{"text_format":"1","workbook":"xlsx","n_sheets":5,"sheets":["Millwall","Comparisons","Sheet1","Sheet2","Sheet3"],"not_rendered":{"charts":1,"images":2,"macros":1,"external_links":5,"defined_names":12,"comments":0,"pivot_tables":0},"unopened":[],"bounds":{"document_bytes":16777216,"sheet_cells":100000,"rows_first":2000,"rows_last":500,"rows_between":2000,"halvings":0,"cell_chars":16384,"cell_head_chars":4096},"cells_cut":0,"cells_raw":0,"read":"whole","date_system":"1900"}

{"sheet":"Millwall","index":0,"n_rows":147,"n_cols":147,"rows_kept":147,"cut":false,"hidden":false,"merged":[[2,146,2,158],[69,68,69,70],[69,72,69,74],[69,76,69,78],[50,84,50,86],[54,62,54,96],[50,79,50,81],[2,79,2,82],[2,67,2,70],[2,71,2,74],[4,65,4,66],[50,67,50,69],[50,71,50,73],[50,75,50,77],[2,76,2,78]]}
[null,null,1,"Competition","Date",null,"Us & Them","Opponents",null,null,null,"Score","HT",null,null,null,null,null,null,null,null,null,null,"Att",null,"Pts","Pos","Goal Scorers"]
[]
[null,null,null,null,null,null,null,null,null,null,null,null,null,null,null,null,null,null,null,null,null,null,null,null,null,null,null,null,null,null,null,null,null,null,null,null,null,null,null,null,null,null,null,null,null,null,null,null,null,null,null,null,null,null,null,null,"Check with Complete History 2010",null,null,null,null,null,null,null,null,null,null,"All",null,null,null,"Division Two",null,null,null,null,"FA Cup",null,null,"League Cup",null,null,null,null,null,null,null,null,null,null,null,null,null,null,null,null,null,null,null,null,null,null,null,null,null,null,null,null,null,null,null,null,null,null,null,null,null,null,null,null,null,null,null,null,null,null,null,null,null,null,null,null,null,null,null,null,null,null,null,null,null,null,null,null,null,null,"Millwall Progress Season 1970/71"]
[null,null,"Game","Competition","Date",null,"Us & Them","Opponents",null,null,null,"Score","HT",null,null,null,null,null,null,null,null,null,null,"Att","Away","Pts","Pos","Goal Scorers",null,null,null,null,"Game","Competition","Date",null,"Opponents",null,null,null,"Score",1,2,3,4,5,6,7,8,9,10,11,12,null,null,null,null,null,null,null,null,null,null,null,null,null,null,null,{"$f":"BP51","v":"Max (46)"},null,null,null,{"$f":"BT51","v":"Max (42)"},null,null,null,{"$f":"BX51","v":"Max (1)"},null,null,null,{"$f":"CB51","v":"Max (3)"},null,null,null,null,null,null,null,null,null,null,null,null,null,null,null,null,1,2,3,4,5,6,7,8,9,10,11,null,11,12,13,14,15,16,17,18,null,null,null,null,null,null,null,null,null,null,null,null,null,null,null,null,null,null,null,null,null,null,"Opposition","Pts","Pos"]
[1,null,1,"Division 2","1970-08-15",null,"- -","Oxford","(H)",null,null,"L 1-2","1-1",null,null,null,null,null,null,null,null,null,null,9895,null,0,18,"Bolland",null,null,1,null,1,{"$f":"D5","v":"Division 2"},{"$f":"E5","v":"1970-08-15"},null,{"$f":"H5","v":"Oxford"},{"$f":"I5","v":"(H)"},null,null,{"$f":"L5","v":"L 1-2"},"King","B Brown","Cripps","Dorney","Kitchener","Burnett","Possee","Jacks","Bolland","Dunphy","Allder",null,null,null,null,null,null,null,null,null,null,null,null,null,"Player      ",null,"Apps","Sub","Nps","Goals","Apps","Sub","Nps","Goals","Apps","Sub","Nps","Goals","Apps","Sub","Nps","Goals",null,null,null,null,null,null,null,null,null,null,null,null,null,null,"King","B Brown","Cripps","Dorney","Kitchener","Burnett","S Brown","Dunphy","Bolland","Possee","Allder",null,null,null,null,null,null,null,null,null,null,null,null,null,null,null,null,null,null,null,null,null,null,null,null,null,null,null,null,null,null,null,"Oxford (H) L 1-2",0,18]
[{"$f":"IF(A5=0,1,IF(A5=2,1,2))","v":2},null,2,"Division 2","1970-08-22",null,"18th v 2nd","Cardiff","(A)",null,null,"D 2-2","0-1",null,null,null,null,null,null,null,null,null,null,25299,null,1,16,"Possee, Cripps",null,null,{"$f":"IF(AE5=0,1,IF(AE5=2,1,2))","v":2},null,2,{"$f":"D6","v":"Division 2"},{"$f":"E6","v":"1970-08-22"},null,{"$f":"H6","v":"Cardiff"},{"$f":"I6","v":"(A)"},null,null,{"$f":"L6","v":"D 2-2"},"King","B Brown","Cripps","Dorney","Kitchener","Burnett","Possee","Jacks ()","Bolland","Dunphy","Allder","S Brown ()",null,null,null,"Apps","Sub","Apps","Sub","Apps","Sub",null,null,null,null,null,null,null,null,null,null,null,null,null,null,null,null,null,null,null,null,null,null,null,null,null,null,null,null,null,null,null,null,null,null,null,null,null,null,null,null,null,null,null,null,null,null,null,null,null,null,null,null,null,null,null,null,null,null,null,null,null,null,null,null,null,null,null,null,null,null,null,null,null,null,null,null,null,"Cardiff (A) D 2-2",1,16]
{"$rows_left_out":142}
{"sheet":"Comparisons","index":1,"n_rows":265,"n_cols":93,"rows_kept":265,"cut":false,"hidden":false,"merged":[]}
[]
[null,null,null,null,null,null,null,null,null,null,{"$f":"IF(K3=0,0,1)","v":1},{"$f":"IF(L3=0,0,1)","v":1},1,1,1,1,1,1,1,1,1,1,1,1,1,1,1,0,0,0,1,0,0,0,0,0,0,0,0,0,0,0,0,0,null,null,null,null,null,null,null,null,null,null,null,null,null,null,null,null,null,null,null,null,null,null,null,null,null,null,null,{"$f":"IF(BT3=0,0,1)","v":1},0,0,0,0,0,0,0,0,0,0,0]
["Formulas",null,null,null,null,"Date",null,"Opponents","Venue / Result",null,{"$f":"Millwall!$BO$72","v":"Allder"},{"$f":"Millwall!$BO$73","v":"Bolland"},{"$f":"Millwall!$BO$74","v":"Bridges"},{"$f":"Millwall!$BO$75","v":"B Brown"},{"$f":"Millwall!$BO$76","v":"S Brown"},{"$f":"Millwall!$BO$77","v":"Burnett"},{"$f":"Millwall!$BO$78","v":"Coxhill"},{"$f":"Millwall!$BO$79","v":"Cripps"},{"$f":"Millwall!$BO$80","v":"Dorney"},{"$f":"Millwall!$BO$81","v":"Dunphy"},{"$f":"Millwall!$BO$82","v":"Garner"},{"$f":"Millwall!$BO$83","v":"Holmes"},{"$f":"Millwall!$BO$84","v":"Jacks"},{"$f":"Millwall!$BO$85","v":"King"},{"$f":"Millwall!$BO$86","v":"Kitchener"},{"$f":"Millwall!$BO$87","v":"Neil"},{"$f":"Millwall!$BO$88","v":"Possee"},{"$f":"Millwall!$BO$89","v":0},{"$f":"Millwall!$BO$90","v":0},{"$f":"Millwall!$BO$91","v":0},{"$f":"Millwall!$BO$92","v":"Own Goal"},{"$f":"Millwall!$BO$93","v":0},{"$f":"Millwall!$BO$94","v":0},{"$f":"Millwall!$BO$95","v":0},{"$f":"Millwall!$BO$96","v":0},{"$f":"Millwall!$BO$97","v":0},{"$f":"Millwall!$BO$98","v":0},{"$f":"Millwall!$BO$99","v":0},{"$f":"Millwall!$BO$100","v":0},{"$f":"Millwall!$BO$101","v":0},{"$f":"Millwall!$BO$102","v":0},{"$f":"Millwall!$BO$103","v":0},{"$f":"Millwall!$BO$104","v":0},{"$f":"Millwall!$BO$105","v":0},null,null,null,null,null,{"$f":"Millwall!$BN72&\" (**\"","v":"Allder** (**"},{"$f":"Millwall!$BN73&\" (**\"","v":"Bolland** (**"},{"$f":"Millwall!$BN74&\" (**\"","v":"Bridges** (**"},{"$f":"Millwall!$BN75&\" (**\"","v":"B Brown** (**"},{"$f":"Millwall!$BN76&\" (**\"","v":"S Brown** (**"},{"$f":"Millwall!$BN77&\" (**\"","v":"Burnett** (**"},{"$f":"Millwall!$BN78&\" (**\"","v":"Coxhill** (**"},{"$f":"Millwall!$BN79&\" (**\"","v":"Cripps** (**"},{"$f":"Millwall!$BN80&\" (**\"","v":"Dorney** (**"},{"$f":"Millwall!$BN81&\" (**\"","v":"Dunphy** (**"},{"$f":"Millwall!$BN82&\" (**\"","v":"Garner** (**"},{"$f":"Millwall!$BN83&\" (**\"","v":"Holmes** (**"},{"$f":"Millwall!$BN84&\" (**\"","v":"Jacks** (**"},{"$f":"Millwall!$BN85&\" (**\"","v":"King** (**"},{"$f":"Millwall!$BN86&\" (**\"","v":"Kitchener** (**"},{"$f":"Millwall!$BN87&\" (**\"","v":"Neil** (**"},{"$f":"Millwall!$BN88&\" (**\"","v":"Possee** (**"},{"$f":"Millwall!$BN89&\" (**\"","v":" (**"},{"$f":"Millwall!$BN90&\" (**\"","v":" (**"},{"$f":"Millwall!$BN91&\" (**\"","v":" (**"},{"$f":"Millwall!$BN92&\" (**\"","v":" (**"},{"$f":"Millwall!$BN93&\" (**\"","v":" (**"},{"$f":"Millwall!$BN94&\" (**\"","v":" (**"}]
[null,null,1,null,null,null,null,null,null,null,"Allder**","Bolland**","Bridges**","B Brown**","S Brown**","Burnett**","Coxhill**","Cripps**","Dorney**","Dunphy**","Garner**","Holmes**","Jacks**","King**","Kitchener**","Neil**","Possee**"]
[null,null,{"$f":"IF(J5=0,1,0)","v":0},1,null,{"$f":"Millwall!AI78","v":"1970-08-15"},null,{"$f":"Millwall!AK78","v":"Oxford"},{"$f":"Millwall!AL78","v":"(H)"},{"$f":"Millwall!AO78","v":"L 1-2"},{"$f":"MATCH(K$4,Millwall!$AP78:$BA78,0)","v":11},{"$f":"MATCH(L$4,Millwall!$AP78:$BA78,0)","v":9},{"$f":"MATCH(M$4,Millwall!$AP78:$BA78,0)","v":{"$error":"#N/A"}},{"$f":"MATCH(N$4,Millwall!$AP78:$BA78,0)","v":2},{"$f":"MATCH(O$4,Millwall!$AP78:$BA78,0)","v":{"$error":"#N/A"}},{"$f":"MATCH(P$4,Millwall!$AP78:$BA78,0)","v":6},{"$f":"MATCH(Q$4,Millwall!$AP78:$BA78,0)","v":{"$error":"#N/A"}},{"$f":"MATCH(R$4,Millwall!$AP78:$BA78,0)","v":3},{"$f":"MATCH(S$4,Millwall!$AP78:$BA78,0)","v":4},{"$f":"MATCH(T$4,Millwall!$AP78:$BA78,0)","v":10},{"$f":"MATCH(U$4,Millwall!$AP78:$BA78,0)","v":{"$error":"#N/A"}},{"$f":"MATCH(V$4,Millwall!$AP78:$BA78,0)","v":{"$error":"#N/A"}},{"$f":"MATCH(W$4,Millwall!$AP78:$BA78,0)","v":8},{"$f":"MATCH(X$4,Millwall!$AP78:$BA78,0)","v":1},{"$f":"MATCH(Y$4,Millwall!$AP78:$BA78,0)","v":5},{"$f":"MATCH(Z$4,Millwall!$AP78:$BA78,0)","v":{"$error":"#N/A"}},{"$f":"MATCH(AA$4,Millwall!$AP78:$BA78,0)","v":7},{"$f":"MATCH(AB$4,Millwall!$AP78:$BA78,0)","v":{"$error":"#N/A"}},{"$f":"MATCH(AC$4,Millwall!$AP78:$BA78,0)","v":{"$error":"#N/A"}},{"$f":"MATCH(AD$4,Millwall!$AP78:$BA78,0)","v":{"$error":"#N/A"}},{"$f":"MATCH(AE$4,Millwall!$AP78:$BA78,0)","v":{"$error":"#N/A"}},{"$f":"MATCH(AF$4,Millwall!$AP78:$BA78,0)","v":{"$error":"#N/A"}},{"$f":"MATCH(AG$4,Millwall!$AP78:$BA78,0)","v":{"$error":"#N/A"}},{"$f":"MATCH(AH$3,Millwall!$AP78:$BA78,0)","v":{"$error":"#N/A"}},{"$f":"MATCH(AI$3,Millwall!$AP78:$BA78,0)","v":{"$error":"#N/A"}},{"$f":"MATCH(AJ$3,Millwall!$AP78:$BA78,0)","v":{"$error":"#N/A"}},{"$f":"MATCH(AK$3,Millwall!$AP78:$BA78,0)","v":{"$error":"#N/A"}},{"$f":"MATCH(AL$3,Millwall!$AP78:$BA78,0)","v":{"$error":"#N/A"}},{"$f":"MATCH(AM$3,Millwall!$AP78:$BA78,0)","v":{"$error":"#N/A"}},{"$f":"MATCH(AN$3,Millwall!$AP78:$BA78,0)","v":{"$error":"#N/A"}},{"$f":"MATCH(AO$3,Millwall!$AP78:$BA78,0)","v":{"$error":"#N/A"}},{"$f":"MATCH(AP$3,Millwall!$AP78:$BA78,0)","v":{"$error":"#N/A"}},{"$f":"MATCH(AQ$3,Millwall!$AP78:$BA78,0)","v":{"$error":"#N/A"}},{"$f":"MATCH(AR$3,Millwall!$AP78:$BA78,0)","v":{"$error":"#N/A"}},null,null,null,null,null,{"$f":"MATCH(AX$3,Millwall!$AP78:$BA78,0)","v":{"$error":"#N/A"}},{"$f":"MATCH(AY$3,Millwall!$AP78:$BA78,0)","v":{"$error":"#N/A"}},{"$f":"MATCH(AZ$3,Millwall!$AP78:$BA78,0)","v":{"$error":"#N/A"}},{"$f":"MATCH(BA$3,Millwall!$AP78:$BA78,0)","v":{"$error":"#N/A"}},{"$f":"MATCH(BB$3,Millwall!$AP78:$BA78,0)","v":{"$error":"#N/A"}},{"$f":"MATCH(BC$3,Millwall!$AP78:$BA78,0)","v":{"$error":"#N/A"}},{"$f":"MATCH(BD$3,Millwall!$AP78:$BA78,0)","v":{"$error":"#N/A"}},{"$f":"MATCH(BE$3,Millwall!$AP78:$BA78,0)","v":{"$error":"#N/A"}},{"$f":"MATCH(BF$3,Millwall!$AP78:$BA78,0)","v":{"$error":"#N/A"}},{"$f":"MATCH(BG$3,Millwall!$AP78:$BA78,0)","v":{"$error":"#N/A"}},{"$f":"MATCH(BH$3,Millwall!$AP78:$BA78,0)","v":{"$error":"#N/A"}},{"$f":"MATCH(BI$3,Millwall!$AP78:$BA78,0)","v":{"$error":"#N/A"}},{"$f":"MATCH(BJ$3,Millwall!$AP78:$BA78,0)","v":{"$error":"#N/A"}},{"$f":"MATCH(BK$3,Millwall!$AP78:$BA78,0)","v":{"$error":"#N/A"}},{"$f":"MATCH(BL$3,Millwall!$AP78:$BA78,0)","v":{"$error":"#N/A"}},{"$f":"MATCH(BM$3,Millwall!$AP78:$BA78,0)","v":{"$error":"#N/A"}},{"$f":"MATCH(BN$3,Millwall!$AP78:$BA78,0)","v":{"$error":"#N/A"}},{"$f":"MATCH(BO$3,Millwall!$AP78:$BA78,0)","v":{"$error":"#N/A"}},{"$f":"MATCH(BP$3,Millwall!$AP78:$BA78,0)","v":{"$error":"#N/A"}},{"$f":"MATCH(BQ$3,Millwall!$AP78:$BA78,0)","v":{"$error":"#N/A"}},{"$f":"MATCH(BR$3,Millwall!$AP78:$BA78,0)","v":{"$error":"#N/A"}},{"$f":"MATCH(BS$3,Millwall!$AP78:$BA78,0)","v":{"$error":"#N/A"}},{"$f":"MATCH(BT$3,Millwall!$AP78:$BA78,0)","v":{"$error":"#N/A"}},{"$f":"MATCH(BU$3,Millwall!$AP78:$BA78,0)","v":{"$error":"#N/A"}},{"$f":"MATCH(BV$3,Millwall!$AP78:$BA78,0)","v":{"$error":"#N/A"}},{"$f":"MATCH(BW$3,Millwall!$AP78:$BA78,0)","v":{"$error":"#N/A"}},{"$f":"MATCH(BX$3,Millwall!$AP78:$BA78,0)","v":{"$error":"#N/A"}},{"$f":"MATCH(BY$3,Millwall!$AP78:$BA78,0)","v":{"$error":"#N/A"}},{"$f":"MATCH(BZ$3,Millwall!$AP78:$BA78,0)","v":{"$error":"#N/A"}},{"$f":"MATCH(CA$3,Millwall!$AP78:$BA78,0)","v":{"$error":"#N/A"}},{"$f":"MATCH(CB$3,Millwall!$AP78:$BA78,0)","v":{"$error":"#N/A"}},{"$f":"MATCH(CC$3,Millwall!$AP78:$BA78,0)","v":{"$error":"#N/A"}},{"$f":"MATCH(CD$3,Millwall!$AP78:$BA78,0)","v":{"$error":"#N/A"}},{"$f":"MATCH(CE$3,Millwall!$AP78:$BA78,0)","v":{"$error":"#N/A"}},null,null,null,null,null,null,null,{"$f":"Millwall!$BO72","v":"Allder"},{"$f":"Millwall!$BN72&\" (**\"","v":"Allder** (**"},{"$f":"Millwall!$BN72&\"**\"","v":"Allder****"}]
[null,null,0,2,null,{"$f":"Millwall!AI79","v":"1970-08-22"},null,{"$f":"Millwall!AK79","v":"Cardiff"},{"$f":"Millwall!AL79","v":"(A)"},{"$f":"Millwall!AO79","v":"D 2-2"},{"$f":"MATCH(K$4,Millwall!$AP79:$BA79,0)","v":11},{"$f":"MATCH(L$4,Millwall!$AP79:$BA79,0)","v":9},{"$f":"MATCH(M$4,Millwall!$AP79:$BA79,0)","v":{"$error":"#N/A"}},{"$f":"MATCH(N$4,Millwall!$AP79:$BA79,0)","v":2},{"$f":"MATCH(O$4,Millwall!$AP79:$BA79,0)","v":12},{"$f":"MATCH(P$4,Millwall!$AP79:$BA79,0)","v":6},{"$f":"MATCH(Q$4,Millwall!$AP79:$BA79,0)","v":{"$error":"#N/A"}},{"$f":"MATCH(R$4,Millwall!$AP79:$BA79,0)","v":3},{"$f":"MATCH(S$4,Millwall!$AP79:$BA79,0)","v":4},{"$f":"MATCH(T$4,Millwall!$AP79:$BA79,0)","v":10},{"$f":"MATCH(U$4,Millwall!$AP79:$BA79,0)","v":{"$error":"#N/A"}},{"$f":"MATCH(V$4,Millwall!$AP79:$BA79,0)","v":{"$error":"#N/A"}},{"$f":"MATCH(W$4,Millwall!$AP79:$BA79,0)","v":8},{"$f":"MATCH(X$4,Millwall!$AP79:$BA79,0)","v":1},{"$f":"MATCH(Y$4,Millwall!$AP79:$BA79,0)","v":5},{"$f":"MATCH(Z$4,Millwall!$AP79:$BA79,0)","v":{"$error":"#N/A"}},{"$f":"MATCH(AA$4,Millwall!$AP79:$BA79,0)","v":7},{"$f":"MATCH(AB$4,Millwall!$AP79:$BA79,0)","v":{"$error":"#N/A"}},{"$f":"MATCH(AC$4,Millwall!$AP79:$BA79,0)","v":{"$error":"#N/A"}},{"$f":"MATCH(AD$4,Millwall!$AP79:$BA79,0)","v":{"$error":"#N/A"}},{"$f":"MATCH(AE$4,Millwall!$AP79:$BA79,0)","v":{"$error":"#N/A"}},{"$f":"MATCH(AF$4,Millwall!$AP79:$BA79,0)","v":{"$error":"#N/A"}},{"$f":"MATCH(AG$4,Millwall!$AP79:$BA79,0)","v":{"$error":"#N/A"}},{"$f":"MATCH(AH$3,Millwall!$AP79:$BA79,0)","v":{"$error":"#N/A"}},{"$f":"MATCH(AI$3,Millwall!$AP79:$BA79,0)","v":{"$error":"#N/A"}},{"$f":"MATCH(AJ$3,Millwall!$AP79:$BA79,0)","v":{"$error":"#N/A"}},{"$f":"MATCH(AK$3,Millwall!$AP79:$BA79,0)","v":{"$error":"#N/A"}},{"$f":"MATCH(AL$3,Millwall!$AP79:$BA79,0)","v":{"$error":"#N/A"}},{"$f":"MATCH(AM$3,Millwall!$AP79:$BA79,0)","v":{"$error":"#N/A"}},{"$f":"MATCH(AN$3,Millwall!$AP79:$BA79,0)","v":{"$error":"#N/A"}},{"$f":"MATCH(AO$3,Millwall!$AP79:$BA79,0)","v":{"$error":"#N/A"}},{"$f":"MATCH(AP$3,Millwall!$AP79:$BA79,0)","v":{"$error":"#N/A"}},{"$f":"MATCH(AQ$3,Millwall!$AP79:$BA79,0)","v":{"$error":"#N/A"}},{"$f":"MATCH(AR$3,Millwall!$AP79:$BA79,0)","v":{"$error":"#N/A"}},null,null,null,null,null,{"$f":"MATCH(AX$3,Millwall!$AP79:$BA79,0)","v":{"$error":"#N/A"}},{"$f":"MATCH(AY$3,Millwall!$AP79:$BA79,0)","v":{"$error":"#N/A"}},{"$f":"MATCH(AZ$3,Millwall!$AP79:$BA79,0)","v":{"$error":"#N/A"}},{"$f":"MATCH(BA$3,Millwall!$AP79:$BA79,0)","v":{"$error":"#N/A"}},{"$f":"MATCH(BB$3,Millwall!$AP79:$BA79,0)","v":12},{"$f":"MATCH(BC$3,Millwall!$AP79:$BA79,0)","v":{"$error":"#N/A"}},{"$f":"MATCH(BD$3,Millwall!$AP79:$BA79,0)","v":{"$error":"#N/A"}},{"$f":"MATCH(BE$3,Millwall!$AP79:$BA79,0)","v":{"$error":"#N/A"}},{"$f":"MATCH(BF$3,Millwall!$AP79:$BA79,0)","v":{"$error":"#N/A"}},{"$f":"MATCH(BG$3,Millwall!$AP79:$BA79,0)","v":{"$error":"#N/A"}},{"$f":"MATCH(BH$3,Millwall!$AP79:$BA79,0)","v":{"$error":"#N/A"}},{"$f":"MATCH(BI$3,Millwall!$AP79:$BA79,0)","v":{"$error":"#N/A"}},{"$f":"MATCH(BJ$3,Millwall!$AP79:$BA79,0)","v":8},{"$f":"MATCH(BK$3,Millwall!$AP79:$BA79,0)","v":{"$error":"#N/A"}},{"$f":"MATCH(BL$3,Millwall!$AP79:$BA79,0)","v":{"$error":"#N/A"}},{"$f":"MATCH(BM$3,Millwall!$AP79:$BA79,0)","v":{"$error":"#N/A"}},{"$f":"MATCH(BN$3,Millwall!$AP79:$BA79,0)","v":{"$error":"#N/A"}},{"$f":"MATCH(BO$3,Millwall!$AP79:$BA79,0)","v":{"$error":"#N/A"}},{"$f":"MATCH(BP$3,Millwall!$AP79:$BA79,0)","v":{"$error":"#N/A"}},{"$f":"MATCH(BQ$3,Millwall!$AP79:$BA79,0)","v":{"$error":"#N/A"}},{"$f":"MATCH(BR$3,Millwall!$AP79:$BA79,0)","v":{"$error":"#N/A"}},{"$f":"MATCH(BS$3,Millwall!$AP79:$BA79,0)","v":{"$error":"#N/A"}},{"$f":"MATCH(BT$3,Millwall!$AP79:$BA79,0)","v":{"$error":"#N/A"}},{"$f":"MATCH(BU$3,Millwall!$AP79:$BA79,0)","v":{"$error":"#N/A"}},{"$f":"MATCH(BV$3,Millwall!$AP79:$BA79,0)","v":{"$error":"#N/A"}},{"$f":"MATCH(BW$3,Millwall!$AP79:$BA79,0)","v":{"$error":"#N/A"}},{"$f":"MATCH(BX$3,Millwall!$AP79:$BA79,0)","v":{"$error":"#N/A"}},{"$f":"MATCH(BY$3,Millwall!$AP79:$BA79,0)","v":{"$error":"#N/A"}},{"$f":"MATCH(BZ$3,Millwall!$AP79:$BA79,0)","v":{"$error":"#N/A"}},{"$f":"MATCH(CA$3,Millwall!$AP79:$BA79,0)","v":{"$error":"#N/A"}},{"$f":"MATCH(CB$3,Millwall!$AP79:$BA79,0)","v":{"$error":"#N/A"}},{"$f":"MATCH(CC$3,Millwall!$AP79:$BA79,0)","v":{"$error":"#N/A"}},{"$f":"MATCH(CD$3,Millwall!$AP79:$BA79,0)","v":{"$error":"#N/A"}},{"$f":"MATCH(CE$3,Millwall!$AP79:$BA79,0)","v":{"$error":"#N/A"}},null,null,null,null,null,null,null,{"$f":"Millwall!$BO73","v":"Bolland"},{"$f":"Millwall!$BN73&\" (**\"","v":"Bolland** (**"},{"$f":"Millwall!$BN73&\"**\"","v":"Bolland****"}]
{"$rows_left_out":260}
{"sheet":"Sheet1","index":2,"n_rows":195,"n_cols":63,"rows_kept":195,"cut":false,"hidden":false,"merged":[[155,1,157,1],[155,52,157,52],[200,13,200,14],[201,13,201,14],[125,1,127,1],[125,52,127,52],[135,1,137,1],[135,52,137,52],[145,1,147,1],[145,52,147,52],[95,1,97,1],[95,52,97,52],[105,1,107,1],[105,52,107,52],[115,1,117,1],[115,52,117,52],[65,1,67,1],[65,52,67,52],[75,1,77,1],[75,52,77,52],[85,1,87,1],[85,52,87,52],[35,1,37,1],[35,52,37,52],[45,1,47,1],[45,52,47,52],[55,1,57,1],[55,52,57,52],[5,1,7,1],[5,52,7,52],[15,1,17,1],[15,52,17,52],[25,1,27,1],[25,52,27,52]]}
[]
[null,null,null,null,null,null,null,null,null,null,null,null,null,null,null,null,null,null,null,null,null,null,null,null,null,null,null,null,null,null,null,null,null,null,null,null,null,null,null,null,null,null,null,null,null,null,null,null,null,null,null,null,null,null,null,null,null,null,null,null,null,null,{"$f":"158-70","v":88}]
[]
[]
[]
[null,75,null,null,null,null,null,null,null,null,null,null,null,null,null,null,null,null,null,null,null,null,null,null,null,null,null,null,null,null,null,null,null,null,null,null,null,null,null,null,null,null,null,null,null,null,null,null,null,null,null,null,75]
{"$rows_left_out":190}
{"sheet":"Sheet2","index":3,"n_rows":47,"n_cols":26,"rows_kept":47,"cut":false,"hidden":false,"merged":[]}
[null,null,"Millwall 1970/71 results and fixtures ",null,null,null,{"$f":"[5]Summary!$AP$67","v":47},{"$f":"[5]Summary!$Q$22","v":8},{"$f":"[5]Summary!$AP$10","v":59},1,{"$f":"[5]Summary!$AP$12","v":53},3,{"$f":"[5]Summary!$AP$29","v":30},20,{"$f":"[5]Summary!$AP$31","v":24},22,null,null,{"$f":"[5]Summary!$T$5","v":73},{"$f":"[5]Summary!$AP$11","v":56},2,{"$f":"[5]Summary!$AP$30","v":27},21,null,null,{"$f":"[5]Summary!$U$7","v":"Sunderland (A) W 1-0"}]
[]
[]
[null,null,null,null,null,null,"x"]
[null,"Game","Competition",null,"Pts","Pos","Millwall","Pos","top","Pos","3rd","Pos","20th","Pos","Bottom","Pos","Bottom","Pos","Day","2nd","Pos","21st","Pos",null,null,"Vesus"]
[null,1,"Division 2","Oxford (H) L 1-2",null,null,0,18,2,1,2,3,0,20,0,22,null,null,1,2,2,0,21,null,null,"Oxford (H) L 1-2"]
{"$rows_left_out":42}
{"sheet":"Sheet3","index":4,"n_rows":144,"n_cols":57,"rows_kept":144,"cut":false,"hidden":false,"merged":[[23,50,25,50],[7,1,9,1],[8,50,10,50],[13,50,15,50],[17,1,19,1],[18,50,20,50],[63,50,65,50],[27,1,29,1],[28,50,30,50],[33,50,35,50],[37,1,39,1],[38,50,40,50],[43,50,45,50],[47,1,49,1],[48,50,50,50],[53,50,55,50],[57,1,59,1],[58,50,60,50],[103,50,105,50],[67,1,69,1],[68,50,70,50],[73,50,75,50],[77,1,79,1],[78,50,80,50],[83,50,85,50],[87,1,89,1],[88,50,90,50],[93,50,95,50],[97,1,99,1],[98,50,100,50],[127,1,129,1],[107,1,109,1],[108,50,110,50],[113,50,115,50],[117,1,119,1],[118,50,120,50],[123,50,125,50]]}
[]
[null,null,null,null,null,null,null,null,null,null,null,null,null,null,null,null,null,null,null,null,null,null,null,null,null,null,null,null,null,null,null,null,null,null,null,null,null,null,null,null,null,null,null,null,null,null,null,null,null,null,null,null,null,null,null,5,46]
[]
[]
[]
[null,null,"Points",null,null,null,null,null,null,null,null,null,null,null,null,null,null,null,null,null,null,null,null,null,null,null,null,null,null,null,null,null,null,null,null,null,null,null,null,null,null,null,null,null,null,null,null,null,null,"Position"]
{"$rows_left_out":138}