{"text_format":"1","workbook":"xlsx","n_sheets":5,"sheets":["Millwall","Comparisons","Sheet1","Sheet2","Sheet3"],"not_rendered":{"charts":1,"images":2,"macros":1,"external_links":5,"defined_names":14,"comments":0,"pivot_tables":0},"unopened":[],"bounds":{"document_bytes":16777216,"sheet_cells":100000,"rows_first":2000,"rows_last":500,"rows_between":2000,"halvings":0,"cell_chars":16384,"cell_head_chars":4096},"cells_cut":0,"cells_raw":0,"read":"whole","date_system":"1900"}

{"sheet":"Millwall","index":0,"n_rows":204,"n_cols":147,"rows_kept":204,"cut":false,"hidden":false,"merged":[[4,66,4,67],[2,77,2,79],[69,69,69,71],[69,73,69,75],[69,77,69,79],[65,64,65,98],[2,146,2,158],[2,68,2,71],[2,72,2,75],[50,85,50,87],[50,80,50,82],[50,68,50,70],[50,72,50,74],[50,76,50,78]]}
[null,null,1,"Competition","Date",null,"Us & Them","Opponents",null,null,null,"Score","HT",null,null,null,null,null,null,null,null,null,null,"Att",null,"Pts","Pos","Goal Scorers",null,null,null,null,null,null,null,null,null,null,null,null,null,null,null,null,null,null,null,null,null,null,null,null,null,null,null,null,null,null,null,null,null,null,null,null,null,null,null,null,null,null,null,null,null,null,null,null,null,null,null,null,null,null,null,null,null,null,null,null,null,null,null,null,null,null,null,null,1,451]
[null,null,null,null,null,null,null,null,null,null,null,null,null,null,null,null,null,null,null,null,null,null,null,null,null,null,null,null,null,null,null,null,null,null,null,null,null,null,null,null,null,"x"]
[null,null,null,null,null,null,null,null,null,null,null,null,"x",null,null,null,null,null,null,null,null,null,null,null,null,null,null,null,null,null,null,null,null,null,null,null,null,null,null,null,null,"x",null,null,null,null,null,null,null,null,null,null,null,null,null,null,null,null,null,null,null,null,null,null,null,null,null,null,"All",null,null,null,"League",null,null,null,null,"FA Cup",null,null,null,null,null,null,null,null,null,null,null,null,null,null,null,null,null,null,null,null,null,null,null,null,null,null,null,null,null,null,null,null,null,null,null,null,null,null,null,null,null,null,null,null,null,null,null,null,null,null,null,null,null,null,null,null,null,null,null,null,null,null,null,null,null,null,null,null,"Millwall Progress Season 1964/65"]
[null,null,"Game","Competition","Date",null,"Us & Them","Opponents",null,null,null,"Score","HT",null,null,null,null,null,null,null,null,null,null,"Att","Away","Pts","Pos","Goal Scorers",null,null,null,null,"Game","Competition","Date",null,"Opponents",null,null,null,"Score",1,2,3,4,5,6,7,8,9,10,11,null,null,12,null,null,null,null,null,null,null,null,null,null,null,null,null,null,{"$f":"BQ51","v":"Max (49)"},null,null,null,{"$f":"BU51","v":"Max (46)"},null,null,null,{"$f":"BY51","v":"Max (3)"},null,null,null,null,null,null,null,null,null,null,null,null,null,null,null,null,null,null,null,null,1,2,3,4,5,6,7,8,9,10,11,null,11,12,13,14,null,16,17,18,null,null,null,null,null,null,null,null,null,null,null,null,null,null,null,null,null,null,null,null,null,null,"Opposition","Pts","Pos"]
[1,null,1,"Division 3S","1954-08-21",null,"- -","Brighton","(H)",null,null,"W 2-0","1-0",null,null,null,null,null,null,null,null,null,null,25445,null,2,2,"McAllister (2)",null,null,1,null,{"$f":"C5","v":1},"Division 3S","1954-08-21",null,"Brighton","(H)",null,null,"W 2-0","Finlayson","Jardine","Fisher","Heydon","Hurley","Saward","Hazlett","Smith","Summers","McAllister","Ledgerton",null,null,null,null,null,null,null,null,null,null,null,null,null,null,"Player      ",null,"Apps","-","-","Goals","Apps","-","-","Goals","Apps","-","-","Goals",null,null,null,null,null,null,null,null,null,null,null,null,null,null,null,null,null,null,"Finlayson","Jardine","Anslow","Short","Hurley","Heydon","Hazlett","Smith","Pacey","Saward","Summers",null,null,null,null,null,null,null,null,null,null,null,null,null,null,null,null,null,null,null,null,null,null,null,null,null,null,null,null,null,null,null,"Brighton (H) W 2-0",2,2]
[{"$f":"IF(A5=0,1,IF(A5=2,1,2))","v":2},null,2,"Division 3S","1954-08-26",null,"5th v 7th","Leyton Orient","(A)",null,null,"L 0-1","0-1",null,null,null,null,null,null,null,null,null,null,18927,null,2,10,null,null,null,{"$f":"IF(AE5=0,1,IF(AE5=2,1,2))","v":2},null,2,"Division 3S","1954-08-26",null,"Leyton Orient","(A)",null,null,"L 0-1","Finlayson","Jardine","Fisher","Heydon","Hurley","Saward","Johnson","McDowall","Summers","McAllister","Ledgerton",null,null,null,null,null,null,null,null,null,null,null,null,null,null,null,null,null,null,null,null,null,null,null,null,null,null,null,null,null,null,null,null,null,null,null,null,null,null,null,null,null,null,null,null,null,null,null,null,null,null,null,null,null,null,null,null,null,null,null,null,null,null,null,null,null,null,null,null,null,null,null,null,null,null,null,null,null,null,null,null,null,null,null,null,null,null,null,null,"Leyton Orient (A) L 0-1",2,10]
[1,null,3,"Division 3S","1954-08-28",null,"10th v 18th","Torquay","(A)",null,null,"L 2-4","1-1",null,null,null,null,null,null,null,null,null,null,8266,null,2,18,"Shepherd, Johnson",null,null,1,null,3,"Division 3S","1954-08-28",null,"Torquay","(A)",null,null,"L 2-4","Finlayson","Jardine","Fisher","Heydon","Hurley","Saward","Johnson","Shepherd","Summers","McAllister","Ledgerton",null,null,null,null,null,null,null,null,null,null,null,null,1,null,{"$f":"CN7&\" \"&CO7","v":"Stanley Anslow"},null,{"$f":"BU7+BY7","v":41},"-","-",{"$f":"BX7+CB7","v":0},{"$f":"BR72","v":38},"-","-",0,{"$f":"BZ72","v":3},"-","-",0,null,null,{"$f":"IF(BU7=CF7,IF(BY7=CG7,\"OK\",\"Error\"),\"Error\")","v":"OK"},38,3,null,null,null,null,null,{"$f":"CM72","v":72},"Stanley","Anslow",1,7,null,"Anslow",null,"Finlayson","Jardine","Anslow","Short","Hurley","Heydon","Hazlett","Smith","Pacey","Saward","Summers",null,null,null,null,null,null,null,null,null,null,null,null,null,null,null,null,null,null,null,null,null,null,null,null,null,null,null,null,null,null,null,"Torquay (A) L 2-4",2,18]
[2,null,4,"Division 3S","1954-08-30",null,"18th v 7th","Leyton Orient","(H)",null,null,"W 1-0","0-0",null,null,null,null,null,null,null,null,null,null,16060,null,4,8,"Ledgerton",null,null,2,null,4,"Division 3S","1954-08-30",null,"Leyton Orient","(H)",null,null,"W 1-0","Finlayson","Jardine","Fisher","Heydon","Hurley","Thrippleton","Johnson","Saward","Shepherd","McAllister","Ledgerton",null,null,null,null,null,null,null,null,null,null,null,null,{"$f":"IF(BM7=0,1,IF(BM7=2,1,2))","v":2},null,"Gerry Bowler",null,{"$f":"BU8+BY8","v":7},"-","-",{"$f":"BX8+CB8","v":0},7,"-","-",0,0,"-","-",0,null,null,"OK",7,0,null,null,null,null,null,73,"Gerry","Bowler",2,8,null,"Bowler",null,null,null,null,null,null,null,null,null,null,null,null,null,null,null,null,null,null,null,null,null,null,null,null,null,null,null,null,null,null,null,null,null,null,null,null,null,null,null,null,null,null,null,"Leyton Orient (H) W 1-0",4,8]
{"$rows_left_out":197}
{"sheet":"Comparisons","index":1,"n_rows":192,"n_cols":48,"rows_kept":192,"cut":false,"hidden":false,"merged":[]}
[]
[]
["Formulas",null,null,null,null,"Date",null,"Opponents","Venue / Result",null,{"$f":"Millwall!$BP$72","v":"Anslow"},{"$f":"Millwall!$BP$73","v":"Bowler"},{"$f":"Millwall!$BP$74","v":"Brewer"},{"$f":"Millwall!$BP$75","v":"Finlayson"},{"$f":"Millwall!$BP$76","v":"Fisher"},{"$f":"Millwall!$BP$77","v":"Green"},{"$f":"Millwall!$BP$78","v":"Hazlett"},{"$f":"Millwall!$BP$79","v":"Hencher"},{"$f":"Millwall!$BP$80","v":"Heydon"},{"$f":"Millwall!$BP$81","v":"Hurley"},{"$f":"Millwall!$BP$82","v":"Jardine"},{"$f":"Millwall!$BP$83","v":"Johnson"},{"$f":"Millwall!$BP$84","v":"Ledgerton"},{"$f":"Millwall!$BP$85","v":"McAllister"},{"$f":"Millwall!$BP$86","v":"McDowall"},{"$f":"Millwall!$BP$87","v":"Pacey"},{"$f":"Millwall!$BP$88","v":"Prior"},{"$f":"Millwall!$BP$89","v":"Quinn"},{"$f":"Millwall!$BP$90","v":"Ramscar"},{"$f":"Millwall!$BP$91","v":"Reeves"},{"$f":"Millwall!$BP$92","v":"Saward"},{"$f":"Millwall!$BP$93","v":"Shepherd"},{"$f":"Millwall!$BP$94","v":"Short"},{"$f":"Millwall!$BP$95","v":"Smith"},{"$f":"Millwall!$BP$96","v":"Summers"},{"$f":"Millwall!$BP$97","v":"Thrippleton"},{"$f":"Millwall!$BP$98","v":"Veitch"},{"$f":"Millwall!$BP$99","v":0},{"$f":"Millwall!$BP$100","v":0},{"$f":"Millwall!$BP$101","v":0},{"$f":"Millwall!$BP$102","v":0},{"$f":"Millwall!$BP$103","v":"Own Goal"},{"$f":"Millwall!$BP$104","v":0},{"$f":"Millwall!$BP$105","v":0}]
[null,null,null,1,null,{"$f":"Millwall!AI78","v":"1954-08-21"},null,{"$f":"Millwall!AK78","v":"Brighton"},{"$f":"Millwall!AL78","v":"(H)"},{"$f":"Millwall!AO78","v":"W 2-0"},{"$f":"MATCH(K$3,Millwall!$AP78:$AZ78,0)","v":{"$error":"#N/A"}},{"$f":"MATCH(L$3,Millwall!$AP78:$AZ78,0)","v":{"$error":"#N/A"}},{"$f":"MATCH(M$3,Millwall!$AP78:$AZ78,0)","v":{"$error":"#N/A"}},{"$f":"MATCH(N$3,Millwall!$AP78:$AZ78,0)","v":1},{"$f":"MATCH(O$3,Millwall!$AP78:$AZ78,0)","v":3},{"$f":"MATCH(P$3,Millwall!$AP78:$AZ78,0)","v":{"$error":"#N/A"}},{"$f":"MATCH(Q$3,Millwall!$AP78:$AZ78,0)","v":7},{"$f":"MATCH(R$3,Millwall!$AP78:$AZ78,0)","v":{"$error":"#N/A"}},{"$f":"MATCH(S$3,Millwall!$AP78:$AZ78,0)","v":4},{"$f":"MATCH(T$3,Millwall!$AP78:$AZ78,0)","v":5},{"$f":"MATCH(U$3,Millwall!$AP78:$AZ78,0)","v":2},{"$f":"MATCH(V$3,Millwall!$AP78:$AZ78,0)","v":{"$error":"#N/A"}},{"$f":"MATCH(W$3,Millwall!$AP78:$AZ78,0)","v":11},{"$f":"MATCH(X$3,Millwall!$AP78:$AZ78,0)","v":10},{"$f":"MATCH(Y$3,Millwall!$AP78:$AZ78,0)","v":{"$error":"#N/A"}},{"$f":"MATCH(Z$3,Millwall!$AP78:$AZ78,0)","v":{"$error":"#N/A"}},{"$f":"MATCH(AA$3,Millwall!$AP78:$AZ78,0)","v":{"$error":"#N/A"}},{"$f":"MATCH(AB$3,Millwall!$AP78:$AZ78,0)","v":{"$error":"#N/A"}},{"$f":"MATCH(AC$3,Millwall!$AP78:$AZ78,0)","v":{"$error":"#N/A"}},{"$f":"MATCH(AD$3,Millwall!$AP78:$AZ78,0)","v":{"$error":"#N/A"}},{"$f":"MATCH(AE$3,Millwall!$AP78:$AZ78,0)","v":6},{"$f":"MATCH(AF$3,Millwall!$AP78:$AZ78,0)","v":{"$error":"#N/A"}},{"$f":"MATCH(AG$3,Millwall!$AP78:$AZ78,0)","v":{"$error":"#N/A"}},{"$f":"MATCH(AH$3,Millwall!$AP78:$AZ78,0)","v":8},{"$f":"MATCH(AI$3,Millwall!$AP78:$AZ78,0)","v":9},{"$f":"MATCH(AJ$3,Millwall!$AP78:$AZ78,0)","v":{"$error":"#N/A"}},{"$f":"MATCH(AK$3,Millwall!$AP78:$AZ78,0)","v":{"$error":"#N/A"}},{"$f":"MATCH(AL$3,Millwall!$AP78:$AZ78,0)","v":{"$error":"#N/A"}},{"$f":"MATCH(AM$3,Millwall!$AP78:$AZ78,0)","v":{"$error":"#N/A"}},{"$f":"MATCH(AN$3,Millwall!$AP78:$AZ78,0)","v":{"$error":"#N/A"}},{"$f":"MATCH(AO$3,Millwall!$AP78:$AZ78,0)","v":{"$error":"#N/A"}},{"$f":"MATCH(AP$3,Millwall!$AP78:$AZ78,0)","v":{"$error":"#N/A"}},{"$f":"MATCH(AQ$3,Millwall!$AP78:$AZ78,0)","v":{"$error":"#N/A"}},{"$f":"MATCH(AR$3,Millwall!$AP78:$AZ78,0)","v":{"$error":"#N/A"}}]
[null,null,null,2,null,{"$f":"Millwall!AI79","v":"1954-08-26"},null,{"$f":"Millwall!AK79","v":"Leyton Orient"},{"$f":"Millwall!AL79","v":"(A)"},{"$f":"Millwall!AO79","v":"L 0-1"},{"$f":"MATCH(K$3,Millwall!$AP79:$AZ79,0)","v":{"$error":"#N/A"}},{"$f":"MATCH(L$3,Millwall!$AP79:$AZ79,0)","v":{"$error":"#N/A"}},{"$f":"MATCH(M$3,Millwall!$AP79:$AZ79,0)","v":{"$error":"#N/A"}},{"$f":"MATCH(N$3,Millwall!$AP79:$AZ79,0)","v":1},{"$f":"MATCH(O$3,Millwall!$AP79:$AZ79,0)","v":3},{"$f":"MATCH(P$3,Millwall!$AP79:$AZ79,0)","v":{"$error":"#N/A"}},{"$f":"MATCH(Q$3,Millwall!$AP79:$AZ79,0)","v":{"$error":"#N/A"}},{"$f":"MATCH(R$3,Millwall!$AP79:$AZ79,0)","v":{"$error":"#N/A"}},{"$f":"MATCH(S$3,Millwall!$AP79:$AZ79,0)","v":4},{"$f":"MATCH(T$3,Millwall!$AP79:$AZ79,0)","v":5},{"$f":"MATCH(U$3,Millwall!$AP79:$AZ79,0)","v":2},{"$f":"MATCH(V$3,Millwall!$AP79:$AZ79,0)","v":7},{"$f":"MATCH(W$3,Millwall!$AP79:$AZ79,0)","v":11},{"$f":"MATCH(X$3,Millwall!$AP79:$AZ79,0)","v":10},{"$f":"MATCH(Y$3,Millwall!$AP79:$AZ79,0)","v":8},{"$f":"MATCH(Z$3,Millwall!$AP79:$AZ79,0)","v":{"$error":"#N/A"}},{"$f":"MATCH(AA$3,Millwall!$AP79:$AZ79,0)","v":{"$error":"#N/A"}},{"$f":"MATCH(AB$3,Millwall!$AP79:$AZ79,0)","v":{"$error":"#N/A"}},{"$f":"MATCH(AC$3,Millwall!$AP79:$AZ79,0)","v":{"$error":"#N/A"}},{"$f":"MATCH(AD$3,Millwall!$AP79:$AZ79,0)","v":{"$error":"#N/A"}},{"$f":"MATCH(AE$3,Millwall!$AP79:$AZ79,0)","v":6},{"$f":"MATCH(AF$3,Millwall!$AP79:$AZ79,0)","v":{"$error":"#N/A"}},{"$f":"MATCH(AG$3,Millwall!$AP79:$AZ79,0)","v":{"$error":"#N/A"}},{"$f":"MATCH(AH$3,Millwall!$AP79:$AZ79,0)","v":{"$error":"#N/A"}},{"$f":"MATCH(AI$3,Millwall!$AP79:$AZ79,0)","v":9},{"$f":"MATCH(AJ$3,Millwall!$AP79:$AZ79,0)","v":{"$error":"#N/A"}},{"$f":"MATCH(AK$3,Millwall!$AP79:$AZ79,0)","v":{"$error":"#N/A"}},{"$f":"MATCH(AL$3,Millwall!$AP79:$AZ79,0)","v":{"$error":"#N/A"}},{"$f":"MATCH(AM$3,Millwall!$AP79:$AZ79,0)","v":{"$error":"#N/A"}},{"$f":"MATCH(AN$3,Millwall!$AP79:$AZ79,0)","v":{"$error":"#N/A"}},{"$f":"MATCH(AO$3,Millwall!$AP79:$AZ79,0)","v":{"$error":"#N/A"}},{"$f":"MATCH(AP$3,Millwall!$AP79:$AZ79,0)","v":{"$error":"#N/A"}},{"$f":"MATCH(AQ$3,Millwall!$AP79:$AZ79,0)","v":{"$error":"#N/A"}},{"$f":"MATCH(AR$3,Millwall!$AP79:$AZ79,0)","v":{"$error":"#N/A"}}]
[null,null,null,3,null,{"$f":"Millwall!AI80","v":"1954-08-28"},null,{"$f":"Millwall!AK80","v":"Torquay"},{"$f":"Millwall!AL80","v":"(A)"},{"$f":"Millwall!AO80","v":"L 2-4"},{"$f":"MATCH(K$3,Millwall!$AP80:$AZ80,0)","v":{"$error":"#N/A"}},{"$f":"MATCH(L$3,Millwall!$AP80:$AZ80,0)","v":{"$error":"#N/A"}},{"$f":"MATCH(M$3,Millwall!$AP80:$AZ80,0)","v":{"$error":"#N/A"}},{"$f":"MATCH(N$3,Millwall!$AP80:$AZ80,0)","v":1},{"$f":"MATCH(O$3,Millwall!$AP80:$AZ80,0)","v":3},{"$f":"MATCH(P$3,Millwall!$AP80:$AZ80,0)","v":{"$error":"#N/A"}},{"$f":"MATCH(Q$3,Millwall!$AP80:$AZ80,0)","v":{"$error":"#N/A"}},{"$f":"MATCH(R$3,Millwall!$AP80:$AZ80,0)","v":{"$error":"#N/A"}},{"$f":"MATCH(S$3,Millwall!$AP80:$AZ80,0)","v":4},{"$f":"MATCH(T$3,Millwall!$AP80:$AZ80,0)","v":5},{"$f":"MATCH(U$3,Millwall!$AP80:$AZ80,0)","v":2},{"$f":"MATCH(V$3,Millwall!$AP80:$AZ80,0)","v":7},{"$f":"MATCH(W$3,Millwall!$AP80:$AZ80,0)","v":11},{"$f":"MATCH(X$3,Millwall!$AP80:$AZ80,0)","v":10},{"$f":"MATCH(Y$3,Millwall!$AP80:$AZ80,0)","v":{"$error":"#N/A"}},{"$f":"MATCH(Z$3,Millwall!$AP80:$AZ80,0)","v":{"$error":"#N/A"}},{"$f":"MATCH(AA$3,Millwall!$AP80:$AZ80,0)","v":{"$error":"#N/A"}},{"$f":"MATCH(AB$3,Millwall!$AP80:$AZ80,0)","v":{"$error":"#N/A"}},{"$f":"MATCH(AC$3,Millwall!$AP80:$AZ80,0)","v":{"$error":"#N/A"}},{"$f":"MATCH(AD$3,Millwall!$AP80:$AZ80,0)","v":{"$error":"#N/A"}},{"$f":"MATCH(AE$3,Millwall!$AP80:$AZ80,0)","v":6},{"$f":"MATCH(AF$3,Millwall!$AP80:$AZ80,0)","v":8},{"$f":"MATCH(AG$3,Millwall!$AP80:$AZ80,0)","v":{"$error":"#N/A"}},{"$f":"MATCH(AH$3,Millwall!$AP80:$AZ80,0)","v":{"$error":"#N/A"}},{"$f":"MATCH(AI$3,Millwall!$AP80:$AZ80,0)","v":9},{"$f":"MATCH(AJ$3,Millwall!$AP80:$AZ80,0)","v":{"$error":"#N/A"}},{"$f":"MATCH(AK$3,Millwall!$AP80:$AZ80,0)","v":{"$error":"#N/A"}},{"$f":"MATCH(AL$3,Millwall!$AP80:$AZ80,0)","v":{"$error":"#N/A"}},{"$f":"MATCH(AM$3,Millwall!$AP80:$AZ80,0)","v":{"$error":"#N/A"}},{"$f":"MATCH(AN$3,Millwall!$AP80:$AZ80,0)","v":{"$error":"#N/A"}},{"$f":"MATCH(AO$3,Millwall!$AP80:$AZ80,0)","v":{"$error":"#N/A"}},{"$f":"MATCH(AP$3,Millwall!$AP80:$AZ80,0)","v":{"$error":"#N/A"}},{"$f":"MATCH(AQ$3,Millwall!$AP80:$AZ80,0)","v":{"$error":"#N/A"}},{"$f":"MATCH(AR$3,Millwall!$AP80:$AZ80,0)","v":{"$error":"#N/A"}}]
[null,null,null,4,null,{"$f":"Millwall!AI81","v":"1954-08-30"},null,{"$f":"Millwall!AK81","v":"Leyton Orient"},{"$f":"Millwall!AL81","v":"(H)"},{"$f":"Millwall!AO81","v":"W 1-0"},{"$f":"MATCH(K$3,Millwall!$AP81:$AZ81,0)","v":{"$error":"#N/A"}},{"$f":"MATCH(L$3,Millwall!$AP81:$AZ81,0)","v":{"$error":"#N/A"}},{"$f":"MATCH(M$3,Millwall!$AP81:$AZ81,0)","v":{"$error":"#N/A"}},{"$f":"MATCH(N$3,Millwall!$AP81:$AZ81,0)","v":1},{"$f":"MATCH(O$3,Millwall!$AP81:$AZ81,0)","v":3},{"$f":"MATCH(P$3,Millwall!$AP81:$AZ81,0)","v":{"$error":"#N/A"}},{"$f":"MATCH(Q$3,Millwall!$AP81:$AZ81,0)","v":{"$error":"#N/A"}},{"$f":"MATCH(R$3,Millwall!$AP81:$AZ81,0)","v":{"$error":"#N/A"}},{"$f":"MATCH(S$3,Millwall!$AP81:$AZ81,0)","v":4},{"$f":"MATCH(T$3,Millwall!$AP81:$AZ81,0)","v":5},{"$f":"MATCH(U$3,Millwall!$AP81:$AZ81,0)","v":2},{"$f":"MATCH(V$3,Millwall!$AP81:$AZ81,0)","v":7},{"$f":"MATCH(W$3,Millwall!$AP81:$AZ81,0)","v":11},{"$f":"MATCH(X$3,Millwall!$AP81:$AZ81,0)","v":10},{"$f":"MATCH(Y$3,Millwall!$AP81:$AZ81,0)","v":{"$error":"#N/A"}},{"$f":"MATCH(Z$3,Millwall!$AP81:$AZ81,0)","v":{"$error":"#N/A"}},{"$f":"MATCH(AA$3,Millwall!$AP81:$AZ81,0)","v":{"$error":"#N/A"}},{"$f":"MATCH(AB$3,Millwall!$AP81:$AZ81,0)","v":{"$error":"#N/A"}},{"$f":"MATCH(AC$3,Millwall!$AP81:$AZ81,0)","v":{"$error":"#N/A"}},{"$f":"MATCH(AD$3,Millwall!$AP81:$AZ81,0)","v":{"$error":"#N/A"}},{"$f":"MATCH(AE$3,Millwall!$AP81:$AZ81,0)","v":8},{"$f":"MATCH(AF$3,Millwall!$AP81:$AZ81,0)","v":9},{"$f":"MATCH(AG$3,Millwall!$AP81:$AZ81,0)","v":{"$error":"#N/A"}},{"$f":"MATCH(AH$3,Millwall!$AP81:$AZ81,0)","v":{"$error":"#N/A"}},{"$f":"MATCH(AI$3,Millwall!$AP81:$AZ81,0)","v":{"$error":"#N/A"}},{"$f":"MATCH(AJ$3,Millwall!$AP81:$AZ81,0)","v":6},{"$f":"MATCH(AK$3,Millwall!$AP81:$AZ81,0)","v":{"$error":"#N/A"}},{"$f":"MATCH(AL$3,Millwall!$AP81:$AZ81,0)","v":{"$error":"#N/A"}},{"$f":"MATCH(AM$3,Millwall!$AP81:$AZ81,0)","v":{"$error":"#N/A"}},{"$f":"MATCH(AN$3,Millwall!$AP81:$AZ81,0)","v":{"$error":"#N/A"}},{"$f":"MATCH(AO$3,Millwall!$AP81:$AZ81,0)","v":{"$error":"#N/A"}},{"$f":"MATCH(AP$3,Millwall!$AP81:$AZ81,0)","v":{"$error":"#N/A"}},{"$f":"MATCH(AQ$3,Millwall!$AP81:$AZ81,0)","v":{"$error":"#N/A"}},{"$f":"MATCH(AR$3,Millwall!$AP81:$AZ81,0)","v":{"$error":"#N/A"}}]
[null,null,null,5,null,{"$f":"Millwall!AI82","v":"1954-09-04"},null,{"$f":"Millwall!AK82","v":"Bristol C"},{"$f":"Millwall!AL82","v":"(H)"},{"$f":"Millwall!AO82","v":"L 1-3"},{"$f":"MATCH(K$3,Millwall!$AP82:$AZ82,0)","v":{"$error":"#N/A"}},{"$f":"MATCH(L$3,Millwall!$AP82:$AZ82,0)","v":{"$error":"#N/A"}},{"$f":"MATCH(M$3,Millwall!$AP82:$AZ82,0)","v":{"$error":"#N/A"}},{"$f":"MATCH(N$3,Millwall!$AP82:$AZ82,0)","v":1},{"$f":"MATCH(O$3,Millwall!$AP82:$AZ82,0)","v":3},{"$f":"MATCH(P$3,Millwall!$AP82:$AZ82,0)","v":{"$error":"#N/A"}},{"$f":"MATCH(Q$3,Millwall!$AP82:$AZ82,0)","v":{"$error":"#N/A"}},{"$f":"MATCH(R$3,Millwall!$AP82:$AZ82,0)","v":{"$error":"#N/A"}},{"$f":"MATCH(S$3,Millwall!$AP82:$AZ82,0)","v":4},{"$f":"MATCH(T$3,Millwall!$AP82:$AZ82,0)","v":5},{"$f":"MATCH(U$3,Millwall!$AP82:$AZ82,0)","v":2},{"$f":"MATCH(V$3,Millwall!$AP82:$AZ82,0)","v":7},{"$f":"MATCH(W$3,Millwall!$AP82:$AZ82,0)","v":{"$error":"#N/A"}},{"$f":"MATCH(X$3,Millwall!$AP82:$AZ82,0)","v":{"$error":"#N/A"}},{"$f":"MATCH(Y$3,Millwall!$AP82:$AZ82,0)","v":{"$error":"#N/A"}},{"$f":"MATCH(Z$3,Millwall!$AP82:$AZ82,0)","v":{"$error":"#N/A"}},{"$f":"MATCH(AA$3,Millwall!$AP82:$AZ82,0)","v":{"$error":"#N/A"}},{"$f":"MATCH(AB$3,Millwall!$AP82:$AZ82,0)","v":{"$error":"#N/A"}},{"$f":"MATCH(AC$3,Millwall!$AP82:$AZ82,0)","v":10},{"$f":"MATCH(AD$3,Millwall!$AP82:$AZ82,0)","v":{"$error":"#N/A"}},{"$f":"MATCH(AE$3,Millwall!$AP82:$AZ82,0)","v":6},{"$f":"MATCH(AF$3,Millwall!$AP82:$AZ82,0)","v":9},{"$f":"MATCH(AG$3,Millwall!$AP82:$AZ82,0)","v":{"$error":"#N/A"}},{"$f":"MATCH(AH$3,Millwall!$AP82:$AZ82,0)","v":8},{"$f":"MATCH(AI$3,Millwall!$AP82:$AZ82,0)","v":11},{"$f":"MATCH(AJ$3,Millwall!$AP82:$AZ82,0)","v":{"$error":"#N/A"}},{"$f":"MATCH(AK$3,Millwall!$AP82:$AZ82,0)","v":{"$error":"#N/A"}},{"$f":"MATCH(AL$3,Millwall!$AP82:$AZ82,0)","v":{"$error":"#N/A"}},{"$f":"MATCH(AM$3,Millwall!$AP82:$AZ82,0)","v":{"$error":"#N/A"}},{"$f":"MATCH(AN$3,Millwall!$AP82:$AZ82,0)","v":{"$error":"#N/A"}},{"$f":"MATCH(AO$3,Millwall!$AP82:$AZ82,0)","v":{"$error":"#N/A"}},{"$f":"MATCH(AP$3,Millwall!$AP82:$AZ82,0)","v":{"$error":"#N/A"}},{"$f":"MATCH(AQ$3,Millwall!$AP82:$AZ82,0)","v":{"$error":"#N/A"}},{"$f":"MATCH(AR$3,Millwall!$AP82:$AZ82,0)","v":{"$error":"#N/A"}}]
{"$rows_left_out":185}
{"sheet":"Sheet1","index":2,"n_rows":195,"n_cols":63,"rows_kept":195,"cut":false,"hidden":false,"merged":[[155,1,157,1],[155,52,157,52],[200,13,200,14],[201,13,201,14],[125,1,127,1],[125,52,127,52],[135,1,137,1],[135,52,137,52],[145,1,147,1],[145,52,147,52],[95,1,97,1],[95,52,97,52],[105,1,107,1],[105,52,107,52],[115,1,117,1],[115,52,117,52],[65,1,67,1],[65,52,67,52],[75,1,77,1],[75,52,77,52],[85,1,87,1],[85,52,87,52],[35,1,37,1],[35,52,37,52],[45,1,47,1],[45,52,47,52],[55,1,57,1],[55,52,57,52],[5,1,7,1],[5,52,7,52],[15,1,17,1],[15,52,17,52],[25,1,27,1],[25,52,27,52]]}
[]
[null,null,null,null,null,null,null,null,null,null,null,null,null,null,null,null,null,null,null,null,null,null,null,null,null,null,null,null,null,null,null,null,null,null,null,null,null,null,null,null,null,null,null,null,null,null,null,null,null,null,null,null,null,null,null,null,null,null,null,null,null,null,{"$f":"158-70","v":88}]
[]
[]
[]
[null,75,null,null,null,null,null,null,null,null,null,null,null,null,null,null,null,null,null,null,null,null,null,null,null,null,null,null,null,null,null,null,null,null,null,null,null,null,null,null,null,null,null,null,null,null,null,null,null,null,null,null,75]
[]
[]
{"$rows_left_out":188}
{"sheet":"Sheet2","index":3,"n_rows":52,"n_cols":26,"rows_kept":52,"cut":false,"hidden":false,"merged":[]}
[null,null,"Millwall 1954/55 results and fixtures ",null,null,null,{"$f":"[5]Summary!$AP$66","v":51},{"$f":"[5]Summary!$Q$22","v":5},{"$f":"[5]Summary!$AP$10","v":70},1,{"$f":"[5]Summary!$AP$11","v":61},2,{"$f":"[5]Summary!$AP$31","v":37},22,{"$f":"[5]Summary!$AP$33","v":31},24,null,null,{"$f":"[5]Summary!$T$5","v":84},{"$f":"[5]Summary!$AP$11","v":61},2,{"$f":"[5]Summary!$AP$32","v":34},23,null,null,{"$f":"[5]Summary!$U$7","v":"Exeter (H) D 2-2"}]
[]
[]
[null,null,null,null,null,null,"x"]
[null,"Game","Competition",null,"Pts","Pos","Millwall","Pos","top","Pos","2nd","Pos","22nd","Pos","Bottom","Pos","Bottom","Pos","Day","2nd","Pos","23rd","Pos",null,null,"Vesus"]
[null,1,"Division 3S","Brighton (H) W 2-0",null,null,2,2,2,1,2,2,0,22,0,24,null,null,1,2,2,0,23,null,null,"Brighton (H) W 2-0"]
[null,2,"Division 3S","Leyton Orient (A) L 0-1",null,null,2,10,4,1,4,2,1,22,0,24,null,null,5,4,2,1,23,null,null,"Leyton Orient (A) L 0-1"]
[null,3,"Division 3S","Torquay (A) L 2-4",null,null,2,18,6,1,5,2,1,22,1,24,null,null,6,5,2,1,23,null,null,"Torquay (A) L 2-4"]
{"$rows_left_out":45}
{"sheet":"Sheet3","index":4,"n_rows":144,"n_cols":57,"rows_kept":144,"cut":false,"hidden":false,"merged":[[127,1,129,1],[107,1,109,1],[108,52,110,52],[113,52,115,52],[117,1,119,1],[118,52,120,52],[123,52,125,52],[87,1,89,1],[88,52,90,52],[93,52,95,52],[97,1,99,1],[98,52,100,52],[103,52,105,52],[67,1,69,1],[68,52,70,52],[73,52,75,52],[77,1,79,1],[78,52,80,52],[83,52,85,52],[47,1,49,1],[48,52,50,52],[53,52,55,52],[57,1,59,1],[58,52,60,52],[63,52,65,52],[27,1,29,1],[28,52,30,52],[33,52,35,52],[37,1,39,1],[38,52,40,52],[43,52,45,52],[7,1,9,1],[8,52,10,52],[13,52,15,52],[17,1,19,1],[18,52,20,52],[23,52,25,52]]}
[]
[null,null,null,null,null,null,null,null,null,null,null,null,null,null,null,null,null,null,null,null,null,null,null,null,null,null,null,null,null,null,null,null,null,null,null,null,null,null,null,null,null,null,null,null,null,null,null,null,null,null,null,null,null,null,null,4,50]
[]
[]
[]
[null,null,"Points",null,null,null,null,null,null,null,null,null,null,null,null,null,null,null,null,null,null,null,null,null,null,null,null,null,null,null,null,null,null,null,null,null,null,null,null,null,null,null,null,null,null,null,null,null,null,null,null,"Position"]
[]
[null,60]
{"$rows_left_out":136}